Target
Lysosomal Pro-X carboxypeptidase
Ligand
BDBM193279
Substrate
Meas. Tech.
Activation Assay
Ki
5.014e+4±n/a nM
Citation
 Shariat-Madar, ZRimoldi, JMGadepalli, RS Selective inhibitors of prolylcarboxypeptidase US Patent  US9193762 Publication Date 11/24/2015 
Target
Name:
Lysosomal Pro-X carboxypeptidase
Synonyms:
Angiotensinase C PCP PRCP Prolylcarboxypeptidase | Prolylcarboxypeptidase (PRCP)
Type:
Enzyme
Mol. Mass.:
55805.19
Organism:
Homo sapiens (Human)
Description:
P42785
Residue:
496
  
Inhibitor
Name:
BDBM193279
Synonyms:
US9193762, RS-48-01
Type:
Small organic molecule
Emp. Form.:
C16H32N2O
Mol. Mass.:
268.4381
SMILES:
CCCCCCCCCCCCNC(=O)C1CCN1
: