Target
Serine protease 1
Ligand
BDBM193316
Substrate
Meas. Tech.
Inhibition Assay
pH
8±n/a
Temperature
298.15±n/a K
IC50
0.26±n/a nM
Comments
extracted
Citation
 Fujiyasu, JOhne, KYamaki, SImaizumi, THondo, TMatsuura, KSatou, TSasamura, S Guanidinobenzoic acid compound US Patent  US9199927 Publication Date 12/1/2015 
Target
Name:
Serine protease 1
Synonyms:
Alpha-trypsin chain 1 Beta-trypsin PRSS1 TRP1 TRY1_HUMAN Thrombin & trypsin Trypsin I | Trypsin-1
Type:
Enzyme
Mol. Mass.:
26557.80
Organism:
Homo sapiens (Human)
Description:
P07477
Residue:
247
  
Inhibitor
Name:
BDBM193316
Synonyms:
US9199927, 27
Type:
Small organic molecule
Emp. Form.:
C25H22Cl2N4O5
Mol. Mass.:
529.372
SMILES:
NC(=N)Nc1ccc(cc1)C(=O)Oc1cc(Cl)c(CC(=O)N[C@@H](Cc2ccccc2)C(O)=O)c(Cl)c1
: