Target
Serine protease 1
Ligand
BDBM193414
Substrate
Meas. Tech.
Inhibition Assay
pH
8±n/a
Temperature
298.15±n/a K
IC50
0.22±n/a nM
Comments
extracted
Citation
 Fujiyasu, JOhne, KYamaki, SImaizumi, THondo, TMatsuura, KSatou, TSasamura, S Guanidinobenzoic acid compound US Patent  US9199927 Publication Date 12/1/2015 
Target
Name:
Serine protease 1
Synonyms:
Alpha-trypsin chain 1 Beta-trypsin PRSS1 TRP1 TRY1_HUMAN Thrombin & trypsin Trypsin I | Trypsin-1
Type:
Enzyme
Mol. Mass.:
26557.80
Organism:
Homo sapiens (Human)
Description:
P07477
Residue:
247
  
Inhibitor
Name:
BDBM193414
Synonyms:
US9199927, 96
Type:
Small organic molecule
Emp. Form.:
C30H31ClN4O8
Mol. Mass.:
611.042
SMILES:
CC(C)(Oc1ccc(C[C@H](NC(=O)CCc2ccc(OC(=O)c3ccc(NC(N)=N)cc3)cc2Cl)C(O)=O)cc1)C(O)=O
: