Target
ALK tyrosine kinase receptor [L1196M]
Ligand
BDBM193487
Substrate
Meas. Tech.
Homogeneous Time-resolved fluorescence (HTRF) Assay
Temperature
298.15±n/a K
IC50
4±n/a nM
Comments
extracted
Citation
 Lee, KKim, HRPark, CHLee, COLee, JKJung, HJCho, SYChae, CHChoi, SUHa, JD N2,N4-bis(4-(piperazine-1-yl)phenyl)pirimidine-2,4-diamine derivative or pharmaceutically acceptable salt thereof, and composition containing same as active ingredient for preventing or treating cancer US Patent  US9199944 Publication Date 12/1/2015 
Target
Name:
ALK tyrosine kinase receptor [L1196M]
Synonyms:
ALK ALK tyrosine kinase receptor (ALK) (L1196M) ALK tyrosine kinase receptor (L1196M) Anaplastic lymphoma kinase L1196M (ALK L1196M) | Tyrosine-protein kinase receptor [L1196M]
Type:
Mol. Mass.:
176471.13
Organism:
Homo sapiens (Human)
Description:
Q9UM73[L1196M]
Residue:
1620
  
Inhibitor
Name:
BDBM193487
Synonyms:
US9199944, 69
Type:
Small organic molecule
Emp. Form.:
C27H33F3N8O2
Mol. Mass.:
558.5985
SMILES:
COc1cc(ccc1Nc1ncc(c(Nc2ccc(cc2OC)N2CCNCC2)n1)C(F)(F)F)N1CCNCC1
: