Target
Lysosomal protective protein [29-480]
Ligand
BDBM193593
Substrate
Meas. Tech.
Inhibition Assay
pH
5.5±n/a
Temperature
298.15±n/a K
IC50
6690±n/a nM
Comments
extracted
Citation
 Ruf, SSadowski, TWirth, KSchreuder, HBuning, CKallus, CStrobel, HWehlan, H Biaryl-propionic acid derivatives and their use as pharmaceuticals US Patent  US9199947 Publication Date 12/1/2015 
Target
Name:
Lysosomal protective protein [29-480]
Synonyms:
CTSA Cathepsin A (CTSA) PPGB_HUMAN
Type:
Mol. Mass.:
51408.15
Organism:
Homo sapiens (Human)
Description:
P10619[29-480]
Residue:
452
  
Inhibitor
Name:
BDBM193593
Synonyms:
US9199947, 88
Type:
Small organic molecule
Emp. Form.:
C20H18ClNO3S
Mol. Mass.:
387.88
SMILES:
COc1ccc(cc1C(CC(O)=O)c1ncc(C)s1)-c1ccccc1Cl
: