Target
Aldo-keto reductase family 1 member A1
Ligand
BDBM193855
Substrate
Meas. Tech.
ALR1 in vitro Inhibition Assay
pH
6.2±n/a
IC50
7.62e+3± 9.8e+2 nM
Comments
extracted
Citation
 Ibrar, ATehseen, YKhan, IHameed, ASaeed, AFurtmann, NBajorath, JIqbal, J Coumarin-thiazole and -oxadiazole derivatives: Synthesis, bioactivity and docking studies for aldose/aldehyde reductase inhibitors. Bioorg Chem 68:177-186 (2016)  
Target
Name:
Aldo-keto reductase family 1 member A1
Synonyms:
AK1A1_BOVIN Aldehyde reductase (ALR1)
Type:
Protein
Mol. Mass.:
36620.67
Organism:
Bos taurus (Cattle)
Description:
Residue:
325
  
Inhibitor
Name:
BDBM193855
Synonyms:
(E)-3-(2-(2-(1-(4-methoxyphenyl)ethylidene)hydrazinyl)thiazol-4-yl)-2H-chromen-2-one (6h)
Type:
Small organic molecule
Emp. Form.:
C21H17N3O3S
Mol. Mass.:
391.443
SMILES:
COc1ccc(cc1)C(\C)=N\Nc1nc(cs1)-c1cc2ccccc2oc1=O
: