Target
C-X-C chemokine receptor type 4
Ligand
BDBM50035696
Substrate
Meas. Tech.
Competitive Binding Assay
IC50
100±n/a nM
Citation
 Natchus, MGArrendale, RLiotta, D Tricyclic amino containing compounds for treatment or prevention of symptoms associated with endocrine dysfunction US Patent  US9205085 Publication Date 12/8/2015 
Target
Name:
C-X-C chemokine receptor type 4
Synonyms:
C-X-C chemokine receptor type 4 CXCR4_RAT Cxcr4
Type:
Enzyme
Mol. Mass.:
39342.13
Organism:
Rattus norvegicus (Rat)
Description:
O08565
Residue:
349
  
Inhibitor
Name:
BDBM50035696
Synonyms:
1,1''-{1,4-phenylenebis(methylene)}-bis{1,4,8,11-tetraaza-cyclotetradecane} 1,4,8,11-tetraazacyclotetradecanyl[4-(1,4,8,11-tetraazacyclotetradecanylmethyl)phenyl]methane(8HBr.2H2O) 11''-xylyl bis-1,4,8,11-tetraazacyclotetradecane AMD-3100 CHEMBL2311089 PLERIXAFOR OCTAHYDROCHLORIDE | US9205085, MSX-162
Type:
Small organic molecule
Emp. Form.:
C28H54N8
Mol. Mass.:
502.782
SMILES:
C(N1CCCNCCNCCCNCC1)c1ccc(CN2CCCNCCNCCCNCC2)cc1
: