Target
Liver carboxylesterase 1
Ligand
BDBM195572
Substrate
Meas. Tech.
Gel-based ABPP (CES1)
pH
7.5±n/a
IC50
<5±n/a nM
Comments
extracted
Citation
 Ahn, KBoehm, MBrown, MFCalloway, JChe, YChen, JFennell, KFGeoghegan, KFGilbert, AMGutierrez, JAKalgutkar, ASLanba, ALimberakis, CMagee, TVO'Doherty, IOliver, RPabst, BPandit, JParris, KPfefferkorn, JARolph, TPPatel, RSchuff, BShanmugasundaram, VStarr, JTVarghese, AHVera, NBVernochet, CYan, J Discovery of a Selective Covalent Inhibitor of Lysophospholipase-like 1 (LYPLAL1) as a Tool to Evaluate the Role of this Serine Hydrolase in Metabolism. ACS Chem Biol 11:2529-40 (2016)  
Target
Name:
Liver carboxylesterase 1
Synonyms:
Acyl coenzyme A:cholesterol acyltransferase CES1 EST1_HUMAN Serine hydrolase (CES1)
Type:
Protein
Mol. Mass.:
62520.83
Organism:
Homo sapiens (Human)
Description:
Residue:
567
  
Inhibitor
Name:
BDBM195572
Synonyms:
(R)-N,N-dimethyl-4'-(2-(2-phenylpiperidine-1-carbonyl)-2H-1,2,3-triazol-4-yl)-[1,1'-biphenyl]-4-sulfonamide (3)
Type:
Small organic molecule
Emp. Form.:
C28H29N5O3S
Mol. Mass.:
515.627
SMILES:
CN(C)S(=O)(=O)c1ccc(cc1)-c1ccc(cc1)-c1cnn(n1)C(=O)N1CCCC[C@@H]1c1ccccc1
: