Target
ATP-sensitive inward rectifier potassium channel 1
Ligand
BDBM195909
Substrate
Meas. Tech.
Electrophysiology Assay
pH
7.4±n/a
IC50
60±n/a nM
Comments
extracted
Citation
 Pio, BPasternak, AShahripour, ATang, HWalsh, S Inhibitors of the renal outer medullary potassium channel US Patent  US9206199 Publication Date 12/8/2015 
Target
Name:
ATP-sensitive inward rectifier potassium channel 1
Synonyms:
ATP-regulated potassium channel ROM-K ATP-sensitive inward rectifier potassium channel 1 KCNJ1 Potassium channel (ATP modulatory) ROMK1 The Renal Outer Medullary Potassium (ROMK)
Type:
Enzyme Catalytic Domain
Mol. Mass.:
44809.08
Organism:
Homo sapiens (Human)
Description:
gi_223460826
Residue:
391
  
Inhibitor
Name:
BDBM195909
Synonyms:
US9206199, 1
Type:
Small organic molecule
Emp. Form.:
C24H25N7O4
Mol. Mass.:
475.4998
SMILES:
O=C(Cc1ccc(nc1)-n1cnnn1)N1CCN2C[C@H](OC[C@@H]2C1)c1ccc2C(=O)OCCc2c1
: