Target
Sodium channel protein type 9 subunit alpha
Ligand
BDBM196438
Substrate
Meas. Tech.
FLIPR Assay
pH
7.3±n/a
IC50
278±61 nM
Comments
extracted
Citation
 Kyle, DJNi, CTafesse, LYao, J Aryl substituted indoles and their use as blockers of sodium channels US Patent  US9212139 Publication Date 12/15/2015 
Target
Name:
Sodium channel protein type 9 subunit alpha
Synonyms:
NENA Peripheral sodium channel 1 SCN9A_HUMAN Voltage-gated sodium channel subunit Nav1.7 hNE-Na
Type:
Protein
Mol. Mass.:
226375.97
Organism:
Homo sapiens (Human)
Description:
Q15858
Residue:
1988
  
Inhibitor
Name:
BDBM196438
Synonyms:
US10202344, Compound 35 | US9212139, 35
Type:
Small organic molecule
Emp. Form.:
C23H21N3O2
Mol. Mass.:
371.4317
SMILES:
NC(Cc1cn(-c2ccc(Oc3ccccc3)cc2)c2ccccc12)C(N)=O
: