Target
Leucine-rich repeat serine/threonine-protein kinase 2
Ligand
BDBM196745
Substrate
Meas. Tech.
Lanthascreen Binding Assay
Ki
1.1±n/a nM
Citation
 Baker-Glenn, CBurdick, DJChan, BKChambers, MChen, HEstrada, ASweeney, ZK Pyrazole aminopyrimidine derivatives as LRRK2 modulators US Patent  US9212173 Publication Date 12/15/2015 
Target
Name:
Leucine-rich repeat serine/threonine-protein kinase 2
Synonyms:
Dardarin LRRK2_HUMAN Leucine-rich repeat serine/threonine-protein kinase 2 PARK8
Type:
Protein
Mol. Mass.:
286113.20
Organism:
Homo sapiens (Human)
Description:
Q5S007
Residue:
2527
  
Inhibitor
Name:
BDBM196745
Synonyms:
US9212173, 23
Type:
Small organic molecule
Emp. Form.:
C16H19ClF3N9
Mol. Mass.:
429.831
SMILES:
CCNc1nc(Nc2cnn(c2Cl)C(C)(C)c2nncn2C)ncc1C(F)(F)F
: