Target
Leucine-rich repeat serine/threonine-protein kinase 2
Ligand
BDBM196752
Substrate
Meas. Tech.
Lanthascreen Binding Assay
Ki
0.6±n/a nM
Citation
 Baker-Glenn, CBurdick, DJChan, BKChambers, MChen, HEstrada, ASweeney, ZK Pyrazole aminopyrimidine derivatives as LRRK2 modulators US Patent  US9212173 Publication Date 12/15/2015 
Target
Name:
Leucine-rich repeat serine/threonine-protein kinase 2
Synonyms:
Dardarin LRRK2_HUMAN Leucine-rich repeat serine/threonine-protein kinase 2 PARK8
Type:
Protein
Mol. Mass.:
286113.20
Organism:
Homo sapiens (Human)
Description:
Q5S007
Residue:
2527
  
Inhibitor
Name:
BDBM196752
Synonyms:
US9212173, 30
Type:
Small organic molecule
Emp. Form.:
C19H26F3N9
Mol. Mass.:
437.4652
SMILES:
CCNc1nc(Nc2cn(nc2C)C(C)(C)c2ncn(n2)C(C)C)ncc1C(F)(F)F
: