Target
Metabotropic glutamate receptor 8
Ligand
BDBM196922
Substrate
Meas. Tech.
Pharmacological Assay
EC50
14100±7300 nM
Citation
 Acher, FPin, JGoudet, CEschalier, ABusserolles, JRigault, DLemasson, ICesarini, SCommare, B Hypophosphorous acid derivatives having antihyperalgic activity and biological applications thereof US Patent  US9212196 Publication Date 12/15/2015 
Target
Name:
Metabotropic glutamate receptor 8
Synonyms:
GRM8_RAT Grm8 Metabotropic glutamate receptor 8 (mGlu8) glutamate receptor, metabotropic 8 precursor metabotropic glutamate 8
Type:
Enzyme
Mol. Mass.:
101886.18
Organism:
Rattus norvegicus (Rat)
Description:
P70579
Residue:
908
  
Inhibitor
Name:
BDBM196922
Synonyms:
US9212196, Derivative 18
Type:
Small organic molecule
Emp. Form.:
C15H20NO11P
Mol. Mass.:
421.2932
SMILES:
N[C@H](CCP(O)(=O)C(O)c1ccc(OCC(O)=O)c(OCC(O)=O)c1)C(O)=O
: