Target
Metabotropic glutamate receptor 7
Ligand
BDBM196923
Substrate
Meas. Tech.
Pharmacological Assay
EC50
60200±10600 nM
Citation
 Acher, FPin, JGoudet, CEschalier, ABusserolles, JRigault, DLemasson, ICesarini, SCommare, B Hypophosphorous acid derivatives having antihyperalgic activity and biological applications thereof US Patent  US9212196 Publication Date 12/15/2015 
Target
Name:
Metabotropic glutamate receptor 7
Synonyms:
GRM7_RAT Grm7 Metabotropic glutamate receptor 7 (mGlu7) mGlu7
Type:
Enzyme
Mol. Mass.:
102244.48
Organism:
Rattus norvegicus (Rat)
Description:
P35400
Residue:
915
  
Inhibitor
Name:
BDBM196923
Synonyms:
US9212196, Derivative 19
Type:
Small organic molecule
Emp. Form.:
C15H22NO9P
Mol. Mass.:
391.3102
SMILES:
CCOc1cc(ccc1OCC(O)=O)C(O)P(O)(=O)CC[C@@H](N)C(O)=O
: