Target
Tyrosine-protein kinase BTK
Ligand
BDBM197275
Substrate
Meas. Tech.
Enzymatic Activity Assay
Temperature
298.15±n/a K
IC50
0.6±n/a nM
Comments
extracted
Citation
 Goldstein, DM Tyrosine kinase inhibitors US Patent  US9090621 Publication Date 7/28/2015 
Target
Name:
Tyrosine-protein kinase BTK
Synonyms:
AGMX1 Agammaglobulinaemia tyrosine kinase B cell progenitor kinase BPK BTK_HUMAN Tyrosine Kinase BTK Tyrosine-protein kinase BTK (BTK)
Type:
Enzyme
Mol. Mass.:
76289.95
Organism:
Homo sapiens (Human)
Description:
Q06187
Residue:
659
  
Inhibitor
Name:
BDBM197275
Synonyms:
US9090621, 27B | US9572811, Example 34
Type:
Small organic molecule
Emp. Form.:
C29H26FN7O2
Mol. Mass.:
523.5608
SMILES:
Nc1ncnc2n(C[C@@H]3CCCN3C(=O)C(=CC3CC3)C#N)nc(-c3ccc(Oc4ccccc4)cc3F)c12
: