Target
Serine/threonine-protein kinase B-raf
Ligand
BDBM197690
Substrate
Meas. Tech.
Cell Activity Inhibition Assay
Temperature
310.15±n/a K
EC50
250±n/a nM
Comments
extracted
Citation
 Shim, EKKim, NDShim, TBKim, SY Purinylpyridinylamino-2,4-difluorophenyl sulfonamide derivative, pharmaceutically acceptable salt thereof, preparation method thereof, and pharmaceutical composition with inhibitory activity against Raf kinase, containing same as active ingredient US Patent  US9216981 Publication Date 12/22/2015 
Target
Name:
Serine/threonine-protein kinase B-raf
Synonyms:
B-RAF B-Raf proto-oncogene serine/threonine-protein kinase BRAF1 RAFB1 v-Raf murine sarcoma viral oncogene homolog B1
Type:
Serine/threonine-protein kinase
Mol. Mass.:
84446.00
Organism:
Homo sapiens (Human)
Description:
P15056
Residue:
766
  
Inhibitor
Name:
BDBM197690
Synonyms:
US9216981, 19
Type:
Small organic molecule
Emp. Form.:
C19H15F2N7O2S
Mol. Mass.:
443.43
SMILES:
Fc1ccc(NS(=O)(=O)C2CC2)c(F)c1Nc1ncccc1-c1ncnc2[nH]cnc12
: