Target
Tyrosine-protein kinase JAK1
Ligand
BDBM198627
Substrate
Meas. Tech.
Enzyme Assay
pH
7.5±n/a
IC50
5.7±n/a nM
Citation
 Hayashi, KWatanabe, TToyama, KKamon, JMinami, MUni, MNasu, M Substituted pyrrolo[2,3-h][1,6]naphthyridines and compositions thereof as JAK inhibitors US Patent  US9216999 Publication Date 12/22/2015 
Target
Name:
Tyrosine-protein kinase JAK1
Synonyms:
JAK-1 JAK1A JAK1_HUMAN Janus kinase 1 (JAK1) | Janus kinase 1 JAK1
Type:
Protein
Mol. Mass.:
133293.73
Organism:
Homo sapiens (Human)
Description:
P23458
Residue:
1154
  
Inhibitor
Name:
BDBM198627
Synonyms:
US9216999, 420 | US9556187, Example 420
Type:
Small organic molecule
Emp. Form.:
C16H19F3N6O2S
Mol. Mass.:
416.421
SMILES:
FC(F)(F)CNS(=O)(=O)C[C@H]1CC[C@@H](CC1)c1nnn2cnc3[nH]ccc3c12
: