Target
Tyrosine-protein kinase JAK2
Ligand
BDBM198352
Substrate
Meas. Tech.
Enzyme Assay
pH
7.5±n/a
IC50
2.3±n/a nM
Citation
 Hayashi, KWatanabe, TToyama, KKamon, JMinami, MUni, MNasu, M Substituted pyrrolo[2,3-h][1,6]naphthyridines and compositions thereof as JAK inhibitors US Patent  US9216999 Publication Date 12/22/2015 
Target
Name:
Tyrosine-protein kinase JAK2
Synonyms:
JAK-2 JAK2_HUMAN Janus kinase 2 (JAK2) | Janus kinase 2 (a protein tyrosine kinase)
Type:
Protein
Mol. Mass.:
130684.68
Organism:
Homo sapiens (Human)
Description:
O60674
Residue:
1132
  
Inhibitor
Name:
BDBM198352
Synonyms:
US9216999, 153 | US9556187, Example 153
Type:
Small organic molecule
Emp. Form.:
C16H16BrN7S
Mol. Mass.:
418.314
SMILES:
Brc1ncc(CN2CCC(CC2)c2nnn3cnc4[nH]ccc4c23)s1
: