Target
Glutamate receptor ionotropic, NMDA 2B
Ligand
BDBM198687
Substrate
Meas. Tech.
Radioligand Binding Assay
Temperature
323.15±n/a K
Ki
1.5±n/a nM
Comments
extracted
Citation
 King, DThompson, III, LAShi, JThangathirupathy, SWarrier, JSIslam, IMacor, JE Selective NR2B antagonists US Patent  US9221796 Publication Date 12/29/2015 
Target
Name:
Glutamate receptor ionotropic, NMDA 2B
Synonyms:
GluN2B Grin2b NMDA receptor subunit N2B (GluN2B) NMDE2_RAT | NR2B
Type:
Protein
Mol. Mass.:
166077.66
Organism:
Rattus norvegicus (Rat)
Description:
Q00960
Residue:
1482
  
Inhibitor
Name:
BDBM198687
Synonyms:
US9221796, 18b
Type:
Small organic molecule
Emp. Form.:
C22H25ClN2O2
Mol. Mass.:
384.899
SMILES:
Oc1ccc(cc1)C1CCN(CC1)[C@@H]1CCN(Cc2ccc(Cl)cc2)C1=O
: