Target
Cholinesterase
Ligand
BDBM8961
Substrate
Meas. Tech.
Cholinesterase Inhibition Assay
pH
8±n/a
Temperature
298.15±n/a K
IC50
4e+1± 1 nM
Comments
extracted
Citation
 Osman, WMohamed, TSit, VMVasefi, MSBeazely, MARao, PP Structure-activity relationship studies of benzyl-, phenethyl-, and pyridyl-substituted tetrahydroacridin-9-amines as multitargeting agents to treat Alzheimer's disease. Chem Biol Drug Des 88:710-723 (2016)  
Target
Name:
Cholinesterase
Synonyms:
Acylcholine acylhydrolase Butyrylcholine esterase (BChE) Butyrylcholinesterase (BuChE) CHLE_HUMAN Cholinesterases Pseudocholinesterase
Type:
Homotetramer
Mol. Mass.:
68422.27
Organism:
Homo sapiens (Human)
Description:
P06276
Residue:
602
  
Inhibitor
Name:
BDBM8961
Synonyms:
1,2,3,4-tetrahydro-9-acridinamine 9-THA CHEMBL1337960 Cognex Tracine cid_1935 | tacrine.HCl
Type:
Small organic molecule
Emp. Form.:
C13H14N2
Mol. Mass.:
198.2637
SMILES:
Nc1c2CCCCc2nc2ccccc12
: