Target
Endothelial lipase
Ligand
BDBM199209
Substrate
Meas. Tech.
Endothelial Lipase Assay
pH
7.2±n/a
IC50
124±n/a nM
Comments
extracted
Citation
 Connelly, MAGreco, MYe, H Tricyclic indole derivatives useful endothelial lipase inhibitors US Patent  US9216998 Publication Date 12/22/2015 
Target
Name:
Endothelial lipase
Synonyms:
EDL Endothelial lipase LIPE_MOUSE | Lipg
Type:
Protein
Mol. Mass.:
56643.58
Organism:
Mus musculus (Mouse)
Description:
Q9WVG5
Residue:
500
  
Inhibitor
Name:
BDBM199209
Synonyms:
US9216998, 13
Type:
Small organic molecule
Emp. Form.:
C25H27F3N2O2
Mol. Mass.:
444.4893
SMILES:
CC(C)(C)OC(=O)N1CCn2c(CCc3ccccc3)c(c3cccc(C1)c23)C(F)(F)F
: