Target
ALK tyrosine kinase receptor
Ligand
BDBM199947
Substrate
Meas. Tech.
Inhibition Assay
IC50
1.92±n/a nM
Citation
 Wang, ZLi, LWang, Z Spirocyclic molecules as protein kinase inhibitors US Patent  US9226923 Publication Date 1/5/2016 
Target
Name:
ALK tyrosine kinase receptor
Synonyms:
ALK ALK_HUMAN CD_antigen: CD246
Type:
Protein
Mol. Mass.:
176453.10
Organism:
Homo sapiens (Human)
Description:
Q9UM73
Residue:
1620
  
Inhibitor
Name:
BDBM199947
Synonyms:
US9226923, 5
Type:
Small organic molecule
Emp. Form.:
C24H26Cl2FN5O
Mol. Mass.:
490.401
SMILES:
C[C@@H](Oc1cc(cnc1N)-c1cnn(c1)C1CC2(C1)CCCNC2)c1c(Cl)ccc(F)c1Cl
: