Target
Enteropeptidase
Ligand
BDBM158132
Substrate
Meas. Tech.
Enteropeptidase Inhibition Assay
pH
8±n/a
Ki
1.22±n/a nM
Comments
extracted
Citation
 Koshiba, TTokumasu, MIchimaru, TOhsumi, KNakagawa, TYamada, TMatsumoto, KSuzuki, T Heteroarylcarboxylic acid ester derivative US Patent  US9227949 Publication Date 1/5/2016 
Target
Name:
Enteropeptidase
Synonyms:
ENTK PRSS7 | TMPRSS15
Type:
Enzyme
Mol. Mass.:
112901.62
Organism:
Homo sapiens (Human)
Description:
P98073
Residue:
1019
  
Inhibitor
Name:
BDBM158132
Synonyms:
US9024044, 60 US9655879, 60
Type:
Small organic molecule
Emp. Form.:
C27H26FN3O7S
Mol. Mass.:
555.575
SMILES:
COC(=O)c1cc(NC(=O)C(C)(C)Cc2ccc(s2)C(=O)Oc2ccc(cc2F)C(N)=N)cc(c1)C(=O)OC
: