Target
Serine protease 1
Ligand
BDBM158138
Substrate
Meas. Tech.
Trypsin Inhibition Assay
pH
8±n/a
Ki
1.58±n/a nM
Comments
extracted
Citation
 Koshiba, TTokumasu, MIchimaru, TOhsumi, KNakagawa, TYamada, TMatsumoto, KSuzuki, T Heteroarylcarboxylic acid ester derivative US Patent  US9227949 Publication Date 1/5/2016 
Target
Name:
Serine protease 1
Synonyms:
Alpha-trypsin chain 1 Beta-trypsin PRSS1 TRP1 TRY1_HUMAN Thrombin & trypsin Trypsin I | Trypsin-1
Type:
Enzyme
Mol. Mass.:
26557.80
Organism:
Homo sapiens (Human)
Description:
P07477
Residue:
247
  
Inhibitor
Name:
BDBM158138
Synonyms:
US9024044, 66 US9655879, 66
Type:
Small organic molecule
Emp. Form.:
C27H26FN3O7S
Mol. Mass.:
555.575
SMILES:
CCC(CC)(Cc1ccc(s1)C(=O)Oc1ccc(cc1F)C(N)=N)C(=O)Nc1cc(cc(c1)C(O)=O)C(O)=O
: