Target
Adenosine receptor A3
Ligand
BDBM50060165
Substrate
Meas. Tech.
Radioligand Binding Assay
Ki
583±23 nM
Citation
 Rodríguez, DChakraborty, SWarnick, ECrane, SGao, ZGO'Connor, RJacobson, KACarlsson, J Structure-Based Screening of Uncharted Chemical Space for Atypical Adenosine Receptor Agonists ACS Chem Biol 11:2763-2772 (2016)  
Target
Name:
Adenosine receptor A3
Synonyms:
A3 adenosine receptor (hA3) ADORA3 | Adenosine A3 receptor (A3AR)
Type:
G Protein-Coupled Receptor (GPCR)
Mol. Mass.:
36197.32
Organism:
Homo sapiens (Human)
Description:
P0DMS8
Residue:
318
  
Inhibitor
Name:
BDBM50060165
Synonyms:
(2R,3R,4S,5R)-2-(7-Amino-imidazo[4,5-b]pyridin-3-yl)-5-hydroxymethyl-tetrahydro-furan-3,4-diol Adenosine receptor agonist, 5 | CHEMBL115824
Type:
Small organic molecule
Emp. Form.:
C11H14N4O4
Mol. Mass.:
266.2533
SMILES:
Nc1ccnc2n(cnc12)[C@@H]1O[C@H](CO)[C@@H](O)[C@H]1O
: