Target
Phosphatidylinositol 4,5-bisphosphate 3-kinase catalytic subunit beta isoform
Ligand
BDBM200638
Substrate
Meas. Tech.
Enzyme Inhibition Assay
IC50
4890±n/a nM
Citation
 Taddei, DMOnions, STSmith, AJCopmans, AHBroeckx, RL Phosphoinositide 3-kinase inhibitors US Patent  US9227977 Publication Date 1/5/2016 
Target
Name:
Phosphatidylinositol 4,5-bisphosphate 3-kinase catalytic subunit beta isoform
Synonyms:
PI3-kinase p110 subunit beta PI3Kbeta PIK3CB Phosphatidylinositol 4,5-bisphosphate 3-kinase catalytic subunit beta (PI3Kbeta) Phosphatidylinositol 4,5-bisphosphate 3-kinase catalytic subunit beta isoform (PI3K) Phosphatidylinositol 4,5-bisphosphate 3-kinase catalytic subunit beta isoform (PI3Kbeta) Phosphatidylinositol-4,5-bisphosphate 3-kinase catalytic subunit beta isoform Phosphoinositide 3-Kinase (PI3K), beta Chain A PtdIns-3-kinase p110
Type:
Enzyme Subunit
Mol. Mass.:
122769.00
Organism:
Homo sapiens (Human)
Description:
P42338
Residue:
1070
  
Inhibitor
Name:
BDBM200638
Synonyms:
US9227977, Compound (I)
Type:
Small organic molecule
Emp. Form.:
C36H31F4N7O5
Mol. Mass.:
717.6689
SMILES:
COCCOCCOCC#Cc1cccc2nc(Cn3nc(-c4cc(O)cc(F)c4)c4c(N)ncnc34)n(Cc3ccccc3C(F)(F)F)c(=O)c12
: