Target
Tyrosine-protein kinase BTK
Ligand
BDBM200881
Substrate
Meas. Tech.
Biochemical Enzyme Assay
pH
7.5±n/a
Temperature
303.15±n/a K
IC50
2±n/a nM
Comments
extracted
Citation
 Heng, RHoegenauer, EKKoch, GPulz, RAVulpetti, AWaelchli, R Pyrrolo pyrimidine derivatives US Patent  US9233111 Publication Date 1/12/2016 
Target
Name:
Tyrosine-protein kinase BTK
Synonyms:
AGMX1 Agammaglobulinaemia tyrosine kinase B cell progenitor kinase BPK BTK_HUMAN Tyrosine Kinase BTK Tyrosine-protein kinase BTK (BTK)
Type:
Enzyme
Mol. Mass.:
76289.95
Organism:
Homo sapiens (Human)
Description:
Q06187
Residue:
659
  
Inhibitor
Name:
BDBM200881
Synonyms:
US9233111, 56
Type:
Small organic molecule
Emp. Form.:
C32H37N5O2
Mol. Mass.:
523.6685
SMILES:
CN(C)C1CCC(=CC1)c1cc2c(ncnc2[nH]1)-c1cccc(NC(=O)c2ccc(cc2)C(C)(C)C)c1CO
: