Target
Sodium- and chloride-dependent glycine transporter 1
Ligand
BDBM202242
Substrate
Meas. Tech.
Radioligand Binding Assay
Ki
<1±n/a nM
Citation
 Pohlki, FLange, UAmberg, WOchse, MBehl, BHornberger, WMezler, MHutchins, CWTurner, S Phenalkylamine derivatives, pharmaceutical compositions containing them, and their use in therapy US Patent  US9238619 Publication Date 1/19/2016 
Target
Name:
Sodium- and chloride-dependent glycine transporter 1
Synonyms:
GlyT-1 Glycine Transporters (GlyT1c) SC6A9_HUMAN Sodium- and chloride-dependent glycine transporter 1 Sodium- and chloride-dependent glycine transporter 1 (GlyT1c) Solute carrier family 6 member 9
Type:
Enzyme
Mol. Mass.:
78270.54
Organism:
Homo sapiens (Human)
Description:
P48067
Residue:
706
  
Inhibitor
Name:
BDBM202242
Synonyms:
US9238619, 7
Type:
Small organic molecule
Emp. Form.:
C21H24F2N4O3S
Mol. Mass.:
450.502
SMILES:
Cn1cc(cn1)S(=O)(=O)NCCOc1cccc(c1)C(CN)Cc1cc(F)cc(F)c1
: