Target
Cholinesterase
Ligand
BDBM10592
Substrate
Meas. Tech.
Inhibition Assay
pH
8±n/a
Temperature
298.15±n/a K
IC50
181±15 nM
Comments
extracted
Citation
 Muñoz-Torrero López-Ibarra, DInestrosa Cantín, NMViayna Gaza, ESola Lao, IVázquez Cruz, S Beta-amyloid-directed multitarget compounds for the treatment of alzheimer's disease US Patent  US9238626 Publication Date 1/19/2016 
Target
Name:
Cholinesterase
Synonyms:
Acylcholine acylhydrolase Butyrylcholine esterase (BChE) Butyrylcholinesterase (BuChE) CHLE_HUMAN Cholinesterases Pseudocholinesterase
Type:
Homotetramer
Mol. Mass.:
68422.27
Organism:
Homo sapiens (Human)
Description:
P06276
Residue:
602
  
Inhibitor
Name:
BDBM10592
Synonyms:
7-chloro-15-methyl-10-azatetracyclo[11.3.1.0^{2,11}.0^{4,9}]heptadeca-2,4(9),5,7,10,14-hexaen-3-amine Huprine Y.HCl | US9238626, (+/-)-Huprine Y HCl
Type:
Small organic molecule
Emp. Form.:
C17H17ClN2
Mol. Mass.:
284.783
SMILES:
CC1=CC2CC(C1)c1c(C2)nc2cc(Cl)ccc2c1N
: