Target
Serine/threonine-protein kinase/endoribonuclease IRE1
Ligand
BDBM111008
Substrate
Meas. Tech.
In Vitro Enzyme Assay
pH
7.5±n/a
IC50
1280±n/a nM
Comments
extracted
Citation
 Patterson, JBLonergan, DGFlynn, GAZeng, QPallai, PV IRE-1α inhibitors US Patent  US9241942 Publication Date 1/26/2016 
Target
Name:
Serine/threonine-protein kinase/endoribonuclease IRE1
Synonyms:
ERN1 Endoplasmic reticulum-to-nucleus signaling 1 IRE1 Inositol requiring enzyme 1 (IRE-1alpha) Inositol-requiring protein 1 Ire1-alpha Serine/threonine-protein kinase/endoribonuclease IRE1 hIRE1p
Type:
Enzyme
Mol. Mass.:
109731.20
Organism:
Homo sapiens (Human)
Description:
O75460
Residue:
977
  
Inhibitor
Name:
BDBM111008
Synonyms:
US8614253, 3-39 US9963434, Compound 3-39
Type:
Small organic molecule
Emp. Form.:
C7H5NO4
Mol. Mass.:
167.1189
SMILES:
Oc1ccc(cc1C=O)[N+]([O-])=O
: