Target
Serine/threonine-protein kinase/endoribonuclease IRE1
Ligand
BDBM111303
Substrate
Meas. Tech.
In Vitro Enzyme Assay
pH
7.5±n/a
IC50
21±n/a nM
Comments
extracted
Citation
 Patterson, JBLonergan, DGFlynn, GAZeng, QPallai, PV IRE-1α inhibitors US Patent  US9241942 Publication Date 1/26/2016 
Target
Name:
Serine/threonine-protein kinase/endoribonuclease IRE1
Synonyms:
ERN1 Endoplasmic reticulum-to-nucleus signaling 1 IRE1 Inositol requiring enzyme 1 (IRE-1alpha) Inositol-requiring protein 1 Ire1-alpha Serine/threonine-protein kinase/endoribonuclease IRE1 hIRE1p
Type:
Enzyme
Mol. Mass.:
109731.20
Organism:
Homo sapiens (Human)
Description:
O75460
Residue:
977
  
Inhibitor
Name:
BDBM111303
Synonyms:
US8614253, 43-63 | US9241942, 27-63
Type:
Small organic molecule
Emp. Form.:
C15H11NO6
Mol. Mass.:
301.2509
SMILES:
COC(=O)c1ccc(cc1)-c1cc(C=O)c(O)c(c1)N(=O)=O
: