Target
Serine/threonine-protein kinase/endoribonuclease IRE1
Ligand
BDBM111404
Substrate
Meas. Tech.
In Vitro Enzyme Assay
pH
7.5±n/a
IC50
34±n/a nM
Comments
extracted
Citation
 Patterson, JBLonergan, DGFlynn, GAZeng, QPallai, PV IRE-1α inhibitors US Patent  US9241942 Publication Date 1/26/2016 
Target
Name:
Serine/threonine-protein kinase/endoribonuclease IRE1
Synonyms:
ERN1 Endoplasmic reticulum-to-nucleus signaling 1 IRE1 Inositol requiring enzyme 1 (IRE-1alpha) Inositol-requiring protein 1 Ire1-alpha Serine/threonine-protein kinase/endoribonuclease IRE1 hIRE1p
Type:
Enzyme
Mol. Mass.:
109731.20
Organism:
Homo sapiens (Human)
Description:
O75460
Residue:
977
  
Inhibitor
Name:
BDBM111404
Synonyms:
US8614253, 38-5 | US9241942, 38-5
Type:
Small organic molecule
Emp. Form.:
C15H15NO2S
Mol. Mass.:
273.35
SMILES:
COc1cc(cc(\C=N\C2CC2)c1O)-c1cccs1
: