Target
Tyrosine-protein kinase JAK3 [781-1124]
Ligand
BDBM202555
Substrate
Meas. Tech.
JAK3 ELISA-based Kinase Activity Assay
IC50
470±36 nM
Citation
 Forster, MChaikuad, ABauer, SMHolstein, JRobers, MBCorona, CRGehringer, MPfaffenrot, EGhoreschi, KKnapp, SLaufer, SA Selective JAK3 Inhibitors with a Covalent Reversible Binding Mode Targeting a New Induced Fit Binding Pocket. Cell Chem Biol 23:1335-1340 (2016)  
Target
Name:
Tyrosine-protein kinase JAK3 [781-1124]
Synonyms:
JAK3 JAK3_HUMAN Tyrosine-protein kinase JAK3 Tyrosine-protein kinase JAK3 (aa 781-1124)
Type:
Mol. Mass.:
38772.27
Organism:
Homo sapiens (Human)
Description:
P52333[781-1124]
Residue:
344
  
Inhibitor
Name:
BDBM202555
Synonyms:
(E)-3-(3-(1-cyclohexyl-1,6-dihydroimidazo[4,5-d]pyrrolo[2,3-b]pyridin-2-yl)phenyl)acrylamide (6)
Type:
Small organic molecule
Emp. Form.:
C23H23N5O
Mol. Mass.:
385.4616
SMILES:
NC(=O)\C=C\c1cccc(c1)-c1nc2cnc3[nH]ccc3c2n1C1CCCCC1
: