Target
Amine oxidase [flavin-containing] B
Ligand
BDBM8961
Substrate
Meas. Tech.
Monoamine Oxidase Assay
pH
7.4±n/a
Temperature
311.15±n/a K
IC50
1.2e+2± 7e+2 nM
Comments
extracted
Citation
 Leng, JQin, HLZhu, KJantan, IHussain, MASher, MAmjad, MWNaeem-Ul-Hassan, MAhmad, WBukhari, SN Evaluation of multifunctional synthetic tetralone derivatives for treatment of Alzheimer's disease. Chem Biol Drug Des 88:889-898 (2016)  
Target
Name:
Amine oxidase [flavin-containing] B
Synonyms:
AOFB_RAT Amine oxidase [flavin-containing] B Monoamine Oxidase Type B (MAO-B) Monoamine oxidase B (MAO-B) Monoamine oxidase type B (MAOB) | Monoamine oxidase-B (MAO-B)
Type:
Enzyme
Mol. Mass.:
58469.65
Organism:
Rattus norvegicus (rat)
Description:
P19643
Residue:
520
  
Inhibitor
Name:
BDBM8961
Synonyms:
1,2,3,4-tetrahydro-9-acridinamine 9-THA CHEMBL1337960 Cognex Tracine cid_1935 | tacrine.HCl
Type:
Small organic molecule
Emp. Form.:
C13H14N2
Mol. Mass.:
198.2637
SMILES:
Nc1c2CCCCc2nc2ccccc12
: