Target
Beta-secretase 1
Ligand
BDBM149800
Substrate
Meas. Tech.
Fluorescence Resonance Energy Transfer (FRET) Assay
pH
4.4±n/a
Temperature
298.15±n/a K
IC50
1890±n/a nM
Comments
extracted
Citation
 Munakata, RInoue, MTominaga, HYamasaki, SShiina, YSamizu, KHamaguchi, HHong, L Chromane compounds US Patent  US9242973 Publication Date 1/26/2016 
Target
Name:
Beta-secretase 1
Synonyms:
ASP2 Aspartyl protease 2 BACE1 Beta-secretase (BACE) Beta-secretase 1 (BACE 1) Beta-secretase 1 (BACE1) Beta-site amyloid precursor protein cleaving enzyme 1 Memapsin-2 beta-Secretase (BACE-1) | beta-Secretase (BACE1)
Type:
Protein
Mol. Mass.:
55755.10
Organism:
Homo sapiens (Human)
Description:
P56817
Residue:
501
  
Inhibitor
Name:
BDBM149800
Synonyms:
US8975415, RP81 | US9242973, RP81
Type:
Small organic molecule
Emp. Form.:
C20H21N3O4
Mol. Mass.:
367.3984
SMILES:
COc1cncc(c1)-c1ccc2O[C@H](C)C3(COC3)[C@]3(COC(N)=N3)c2c1
: