Target
Beta-secretase 1
Ligand
BDBM149811
Substrate
Meas. Tech.
Fluorescence Resonance Energy Transfer (FRET) Assay
pH
4.4±n/a
Temperature
298.15±n/a K
Ki
87.9±n/a nM
IC50
124±n/a nM
Comments
extracted
Citation
 Munakata, RInoue, MTominaga, HYamasaki, SShiina, YSamizu, KHamaguchi, HHong, L Chromane compounds US Patent  US9242973 Publication Date 1/26/2016 
Target
Name:
Beta-secretase 1
Synonyms:
ASP2 Aspartyl protease 2 BACE1 Beta-secretase (BACE) Beta-secretase 1 (BACE 1) Beta-secretase 1 (BACE1) Beta-site amyloid precursor protein cleaving enzyme 1 Memapsin-2 beta-Secretase (BACE-1) | beta-Secretase (BACE1)
Type:
Protein
Mol. Mass.:
55755.10
Organism:
Homo sapiens (Human)
Description:
P56817
Residue:
501
  
Inhibitor
Name:
BDBM149811
Synonyms:
US8975415, RP92 | US9242973, RP92
Type:
Small organic molecule
Emp. Form.:
C24H25N3O3
Mol. Mass.:
403.4736
SMILES:
CCCC1Oc2ccc(cc2C2(COC(N)=N2)C11COC1)-c1cncc(c1)C#CC
: