Target
Mitogen-activated protein kinase 1
Ligand
BDBM204193
Substrate
Meas. Tech.
ERK2 (20 pM) Kinase Assay
pH
7.5±n/a
IC50
0.0158±n/a nM
Comments
extracted
Citation
 Bagdanoff, JTDing, YHan, WHuang, ZJiang, QJin, JXKou, XLee, PLindvall, MMin, ZPan, YPecchi, SPfister, KBPoon, DRauniyar, VWang, XMZhang, QZhou, JZhu, S Aminoheteroaryl benzamides as kinase inhibitors US Patent  US9242996 Publication Date 1/26/2016 
Target
Name:
Mitogen-activated protein kinase 1
Synonyms:
ERK2 Extracellular signal-regulated kinase 2 Extracellular signal-regulated kinase 2 (ERK2) MAPK 2 MK01_HUMAN Mitogen-activated protein kinase 1 (ERK-2) Mitogen-activated protein kinase 2 PRKM2 | p42-MAPK
Type:
Ser/Thr Protein Kinase
Mol. Mass.:
41392.76
Organism:
Homo sapiens (Human)
Description:
P28482
Residue:
360
  
Inhibitor
Name:
BDBM204193
Synonyms:
US9242996, 267
Type:
Small organic molecule
Emp. Form.:
C23H19F2IN6O2
Mol. Mass.:
576.3372
SMILES:
Cn1nncc1-c1cnc(N)c(c1)-c1ccc(C(=O)N[C@H](CO)c2cc(F)cc(I)c2)c(F)c1
: