Target
Alpha-enolase
Ligand
BDBM204924
Substrate
Meas. Tech.
Enolase Enzymatic Assays
pH
7.4±n/a
IC50
37.9±0.0 nM
Comments
extracted
Citation
 Leonard, PGSatani, NMaxwell, DLin, YHHammoudi, NPeng, ZPisaneschi, FLink, TMLee, GRSun, DPrasad, BADi Francesco, MECzako, BAsara, JMWang, YABornmann, WDePinho, RAMuller, FL SF2312 is a natural phosphonate inhibitor of enolase. Nat Chem Biol 12:1053-1058 (2016)  
Target
Name:
Alpha-enolase
Synonyms:
2-phospho-D-glycerate hydro-lyase C-myc promoter-binding protein ENO1L1 Enolase 1 MBP-1 MPB-1 NNE Phosphopyruvate hydratase | Plasminogen-binding protein
Type:
Mol. Mass.:
47171.43
Organism:
Homo sapiens (Human)
Description:
P06733
Residue:
434
  
Inhibitor
Name:
BDBM204924
Synonyms:
SF2312
Type:
Small organic molecule
Emp. Form.:
C4H8NO6P
Mol. Mass.:
197.0832
SMILES:
O[C@H]1C[C@@H](C(=O)N1O)P(O)(O)=O
: