Target
Prostaglandin E2 receptor EP2 subtype
Ligand
BDBM204978
Substrate
Meas. Tech.
Cellular Functional Assay
EC50
0.9±n/a nM
Citation
 Feutrill, JLeriche, CMiddlemiss, D Aniline derivatives, their preparation and their therapeutic application US Patent  US9249085 Publication Date 2/2/2016 
Target
Name:
Prostaglandin E2 receptor EP2 subtype
Synonyms:
PE2R2_HUMAN PTGER2 Prostaglandin E2 receptor Prostanoid EP2 Receptor
Type:
Enzyme
Mol. Mass.:
39775.71
Organism:
Homo sapiens (Human)
Description:
P43116
Residue:
358
  
Inhibitor
Name:
BDBM204978
Synonyms:
US9249085, I(al) | US9624159, Compound I(al)
Type:
Small organic molecule
Emp. Form.:
C25H26FNO4
Mol. Mass.:
423.4766
SMILES:
COc1c(C)cc(cc1CNc1c(C)ccc(OCC(O)=O)c1C)-c1cccc(F)c1
: