Target
Bromodomain-containing protein 3 [306-416]
Ligand
BDBM205431
Substrate
Meas. Tech.
Bromodomains Assay for DiscoveRx Gene Symbol
Ki
0.0027±0.0 nM
Citation
 Tanaka, MRoberts, JMSeo, HSSouza, APaulk, JScott, TGDeAngelo, SLDhe-Paganon, SBradner, JE Design and characterization of bivalent BET inhibitors. Nat Chem Biol 12:1089-1096 (2016)  
Target
Name:
Bromodomain-containing protein 3 [306-416]
Synonyms:
BET bromodomain 3(2) (BRD3(2)) BRD3_HUMAN RING3L
Type:
Mol. Mass.:
13068.97
Organism:
Homo sapiens (Human)
Description:
Q15059 (BRD3, 306-416)
Residue:
111
  
Inhibitor
Name:
BDBM205431
Synonyms:
(6S+2S)-PEG1 (7)
Type:
Small organic molecule
Emp. Form.:
C43H42Cl2N10O5S2
Mol. Mass.:
913.894
SMILES:
COC(=O)C[C@@H]1N=C(c2c(C)c(sc2-n2c(C)nnc12)C(=O)NCCOCCNC(=O)C[C@@H]1N=C(c2c(C)c(C)sc2-n2c(C)nnc12)c1ccc(Cl)cc1)c1ccc(Cl)cc1
: