Target
Bromodomain testis-specific protein [21-137]
Ligand
BDBM205437
Substrate
Meas. Tech.
AlphaScreen BRD Binding Assay
pH
7.5±n/a
Temperature
298.15±n/a K
IC50
12.1±0.0 nM
Comments
extracted
Citation
 Tanaka, MRoberts, JMSeo, HSSouza, APaulk, JScott, TGDeAngelo, SLDhe-Paganon, SBradner, JE Design and characterization of bivalent BET inhibitors. Nat Chem Biol 12:1089-1096 (2016)  
Target
Name:
Bromodomain testis-specific protein [21-137]
Synonyms:
BRDT Bromodomain testis 1 (BRDT(1))
Type:
Mol. Mass.:
13934.55
Organism:
Homo sapiens (Human)
Description:
Q58F21 (BRDT, 21-137)
Residue:
117
  
Inhibitor
Name:
BDBM205437
Synonyms:
6S+IBET-PEG1 (18)
Type:
Small organic molecule
Emp. Form.:
C48H48ClN11O6S
Mol. Mass.:
942.483
SMILES:
COc1cc2c3n([C@H](C)c4ccccn4)c(=O)n(CC(=O)NCCOCCNC(=O)C[C@@H]4N=C(c5c(C)c(C)sc5-n5c(C)nnc45)c4ccc(Cl)cc4)c3cnc2cc1-c1c(C)noc1C
: