Target
Bromodomain testis-specific protein [21-137]
Ligand
BDBM205451
Substrate
Meas. Tech.
AlphaScreen BRD Binding Assay
pH
7.5±n/a
Temperature
298.15±n/a K
IC50
60.2±0.0 nM
Comments
extracted
Citation
 Tanaka, MRoberts, JMSeo, HSSouza, APaulk, JScott, TGDeAngelo, SLDhe-Paganon, SBradner, JE Design and characterization of bivalent BET inhibitors. Nat Chem Biol 12:1089-1096 (2016)  
Target
Name:
Bromodomain testis-specific protein [21-137]
Synonyms:
BRDT Bromodomain testis 1 (BRDT(1))
Type:
Mol. Mass.:
13934.55
Organism:
Homo sapiens (Human)
Description:
Q58F21 (BRDT, 21-137)
Residue:
117
  
Inhibitor
Name:
BDBM205451
Synonyms:
IBETx2-PEG4 (33)
Type:
Small organic molecule
Emp. Form.:
C60H66N12O12
Mol. Mass.:
1147.2392
SMILES:
COc1cc2c3n([C@@H](C)c4ccccn4)c(=O)n(CC(=O)NCCOCCOCCOCCOCCNC(=O)Cn4c5cnc6cc(-c7c(C)noc7C)c(OC)cc6c5n([C@H](C)c5ccccn5)c4=O)c3cnc2cc1-c1c(C)noc1C
: