Target
Bromodomain-containing protein 4 [44-168]
Ligand
BDBM205455
Substrate
Meas. Tech.
AlphaScreen BRD Binding Assay
pH
7.5±n/a
Temperature
298.15±n/a K
IC50
158±0.0 nM
Comments
extracted
Citation
 Tanaka, MRoberts, JMSeo, HSSouza, APaulk, JScott, TGDeAngelo, SLDhe-Paganon, SBradner, JE Design and characterization of bivalent BET inhibitors. Nat Chem Biol 12:1089-1096 (2016)  
Target
Name:
Bromodomain-containing protein 4 [44-168]
Synonyms:
BET bromodomain 4(1) (BRD4(1)) BRD4-BD1 protein (aa 44-168) Bromodomain protein 4 (BRD4-BD1) Bromodomain-containing protein 4 (BRD4) (aa 44-168) Bromodomain-containing protein 4 bromodomain 1 (BRD4-BD1) | HUNK1
Type:
Enzyme Catalytic Domain
Mol. Mass.:
14866.49
Organism:
Homo sapiens (Human)
Description:
aa (44-168)
Residue:
125
  
Inhibitor
Name:
BDBM205455
Synonyms:
(6S+6S)-PEG1 (4)
Type:
Small organic molecule
Emp. Form.:
C42H42Cl2N10O3S2
Mol. Mass.:
869.884
SMILES:
Cc1sc-2c(c1C)C(=N[C@H](CC(=O)NCCOCCNC(=O)C[C@@H]1N=C(c3c(C)c(C)sc3-n3c(C)nnc13)c1ccc(Cl)cc1)c1nnc(C)n-21)c1ccc(Cl)cc1
: