Target
Poly [ADP-ribose] polymerase tankyrase-1
Ligand
BDBM27566
Substrate
Meas. Tech.
Enzyme Assay
IC50
1700±n/a nM
Citation
 Zhang, AMiao, ZYe, NHuan, XSong, ZChen, CChen, YDing, J Substituted [1,2,4]triazolo[4,3-a]pyrazines as PARP-1 inhibitors US Patent  US9255106 Publication Date 2/9/2016 
Target
Name:
Poly [ADP-ribose] polymerase tankyrase-1
Synonyms:
(ARTD5 or PARP5a) PARPL Poly [ADP-ribose] polymerase tankyrase-1 TINF1 TNKS1 Tankyrase 1 Tankyrase-1 Tankyrase-1 (TNKS1)
Type:
Enzyme
Mol. Mass.:
142058.03
Organism:
Homo sapiens (Human)
Description:
O95271
Residue:
1327
  
Inhibitor
Name:
BDBM27566
Synonyms:
4-({3-[(4-cyclopropanecarbonylpiperazin-1-yl)carbonyl]-4-fluorophenyl}methyl)-1,2-dihydrophthalazin-1-one Olaparib US10597399, Compound AZD2281 US9255106, AZD2281
Type:
Small organic molecule
Emp. Form.:
C24H23FN4O3
Mol. Mass.:
434.4628
SMILES:
Fc1ccc(Cc2n[nH]c(=O)c3ccccc23)cc1C(=O)N1CCN(CC1)C(=O)C1CC1
: