Target
Tyrosine-protein kinase ABL1 [T315I]
Ligand
BDBM206085
Substrate
Abltide
Meas. Tech.
ABL1 (T315I) Kinase Activity Assay
Temperature
298.15±n/a K
IC50
2.28±0 nM
Comments
extracted
Citation
 Wang, YZhao, LZhang, DWu, FBi, SGao, YChen, HChen, HZhang, CNan, YLiu, Y Heteroaryl alkyne compound and use thereof US Patent  US9255107 Publication Date 2/9/2016 
Target
Name:
Tyrosine-protein kinase ABL1 [T315I]
Synonyms:
ABL ABL1 Abelson murine leukemia viral oncogene homolog 1 Proto-oncogene c-Abl Tyrosine-protein kinase ABL (T315I) c-ABL p150
Type:
Mol. Mass.:
122909.35
Organism:
Homo sapiens (Human)
Description:
P00519 (T315I)
Residue:
1130
  
Inhibitor
Name:
BDBM206085
Synonyms:
US9255107, 5
Type:
Small organic molecule
Emp. Form.:
C30H30F3N7O
Mol. Mass.:
561.6007
SMILES:
CNc1nc2cc(ccn2n1)C#Cc1cc(ccc1C)C(=O)Nc1ccc(CN2CCN(C)CC2)c(c1)C(F)(F)F
:
Substrate
Name:
Abltide
Synonyms:
Type:
Protein
Mol. Mass.:
1338.59
Organism:
Homo sapiens (Human)
Description:
Peptide substrate Abltide (EAIYAAPFAKKK), purchased from Millipore Corporation, USA.
Residue:
12
EAIYAAPFAKKK