Target
Tyrosine-protein kinase BTK
Ligand
BDBM206357
Substrate
Meas. Tech.
Biochemical Btk Assay
pH
7.5±n/a
Ki
2.57±n/a nM
Comments
extracted
Citation
 Crawford, JJWei, BYoung, WB Heteroaryl pyridone and aza-pyridone compounds with electrophilic functionality US Patent  US9260415 Publication Date 2/16/2016 
Target
Name:
Tyrosine-protein kinase BTK
Synonyms:
AGMX1 Agammaglobulinaemia tyrosine kinase B cell progenitor kinase BPK BTK_HUMAN Tyrosine Kinase BTK Tyrosine-protein kinase BTK (BTK)
Type:
Enzyme
Mol. Mass.:
76289.95
Organism:
Homo sapiens (Human)
Description:
Q06187
Residue:
659
  
Inhibitor
Name:
BDBM206357
Synonyms:
US9260415, 108
Type:
Small organic molecule
Emp. Form.:
C34H33FN6O5S
Mol. Mass.:
656.726
SMILES:
C[C@@H](COc1cccc(Nc2cc(cn(C)c2=O)-c2cc(F)cc(c2CO)-n2ncc3c4CCCCc4sc3c2=O)n1)NC(=O)C=C
: