Target
Tyrosine-protein kinase BTK
Ligand
BDBM206360
Substrate
Meas. Tech.
Biochemical Btk Assay
pH
7.5±n/a
Ki
0.494±n/a nM
Comments
extracted
Citation
 Crawford, JJWei, BYoung, WB Heteroaryl pyridone and aza-pyridone compounds with electrophilic functionality US Patent  US9260415 Publication Date 2/16/2016 
Target
Name:
Tyrosine-protein kinase BTK
Synonyms:
AGMX1 Agammaglobulinaemia tyrosine kinase B cell progenitor kinase BPK BTK_HUMAN Tyrosine Kinase BTK Tyrosine-protein kinase BTK (BTK)
Type:
Enzyme
Mol. Mass.:
76289.95
Organism:
Homo sapiens (Human)
Description:
Q06187
Residue:
659
  
Inhibitor
Name:
BDBM206360
Synonyms:
US9260415, 111
Type:
Small organic molecule
Emp. Form.:
C34H34FN7O4S
Mol. Mass.:
655.742
SMILES:
CN(CCNC(=O)C=C)c1cccc(Nc2cc(cn(C)c2=O)-c2cc(F)cc(c2CO)-n2ncc3c4CCCCc4sc3c2=O)n1
: