Target
Tyrosine-protein kinase BTK
Ligand
BDBM206367
Substrate
Meas. Tech.
Biochemical Btk Assay
pH
7.5±n/a
Ki
1.7±n/a nM
Comments
extracted
Citation
 Crawford, JJWei, BYoung, WB Heteroaryl pyridone and aza-pyridone compounds with electrophilic functionality US Patent  US9260415 Publication Date 2/16/2016 
Target
Name:
Tyrosine-protein kinase BTK
Synonyms:
AGMX1 Agammaglobulinaemia tyrosine kinase B cell progenitor kinase BPK BTK_HUMAN Tyrosine Kinase BTK Tyrosine-protein kinase BTK (BTK)
Type:
Enzyme
Mol. Mass.:
76289.95
Organism:
Homo sapiens (Human)
Description:
Q06187
Residue:
659
  
Inhibitor
Name:
BDBM206367
Synonyms:
US9260415, 118
Type:
Small organic molecule
Emp. Form.:
C35H36N8O5
Mol. Mass.:
648.7109
SMILES:
Cn1cc(cc(Nc2cccc(OCCNC(=O)C(=C)C#N)n2)c1=O)-c1ccnc(N2CCn3c4CC(C)(C)Cc4cc3C2=O)c1CO
: