Target
Beta-2 adrenergic receptor
Ligand
BDBM50407517
Substrate
Meas. Tech.
Mitogenesis inhibition method
Temperature
310.15±n/a K
IC50
0.05±0.01 nM
Comments
extracted
Citation
 Wainer, IWBernier, MToll, LRJimenez, LA Use of fenoterol and fenoterol analogues in the treatment of glioblastomas and astrocytomas US Patent  US9492405 Publication Date 11/15/2016 
Target
Name:
Beta-2 adrenergic receptor
Synonyms:
ADRB2 ADRB2_HUMAN Beta-2 adrenoceptor | Beta-2 adrenoreceptor
Type:
Mol. Mass.:
46461.69
Organism:
Homo sapiens (Human)
Description:
P07550
Residue:
413
  
Inhibitor
Name:
BDBM50407517
Synonyms:
(-)ISOPROTERENOL US9492405, 27
Type:
Small organic molecule
Emp. Form.:
C11H17NO3
Mol. Mass.:
211.2576
SMILES:
CC(C)NC[C@H](O)c1ccc(O)c(O)c1
: