Target
Beta-2 adrenergic receptor
Ligand
BDBM50213098
Substrate
Meas. Tech.
Mitogenesis inhibition method
Temperature
310.15±n/a K
IC50
0.14±0.07 nM
Comments
extracted
Citation
 Wainer, IWBernier, MToll, LRJimenez, LA Use of fenoterol and fenoterol analogues in the treatment of glioblastomas and astrocytomas US Patent  US9492405 Publication Date 11/15/2016 
Target
Name:
Beta-2 adrenergic receptor
Synonyms:
ADRB2 ADRB2_HUMAN Beta-2 adrenoceptor | Beta-2 adrenoreceptor
Type:
Mol. Mass.:
46461.69
Organism:
Homo sapiens (Human)
Description:
P07550
Residue:
413
  
Inhibitor
Name:
BDBM50213098
Synonyms:
(R,R)-(-)-fenoterol US10617654, Compound (R,R)-1 US9492405, 28
Type:
Small organic molecule
Emp. Form.:
C17H21NO4
Mol. Mass.:
303.3529
SMILES:
C[C@H](Cc1ccc(O)cc1)NC[C@H](O)c1cc(O)cc(O)c1
: